2008年4月16日

[vine-users:078319] self-build-lameのビルドエラー

warbirdと申します。御世話になっております。

self-build-ffmpegをビルドする為に必要な、self-build-lameパッケージ
をビルドしています。
しかながら、次のようなエラーになってしまい、ビルドエラーに
なってしまいます。
------
make[3]: ディレクトリ `/var/tmp/self-build-lame.L24103/rpm/BUILD/lame-3.97/libmp3lame/i386' に入ります

test -d .libs || mkdir .libs
echo '# Generated by ltmain.sh - GNU libtool 1.5 (1.1220 2003/04/05 19:32:58)' >choose_table.lo
echo "pic_object='.libs/choose_table.o'" >>choose_table.lo
echo "non_pic_object='choose_table.o'" >>choose_table.lo
/usr/bin/nasm -f elf -i ../../libmp3lame/i386/ choose_table.nas -o .libs/choose_table.o -l choose_table.lo.lst
make[3]: *** [choose_table.lo] 浮動小数点演算例外です
make[3]: *** ファイル `choose_table.lo' を削除します
make[3]: ディレクトリ `/var/tmp/self-build-lame.L24103/rpm/BUILD/lame-3.97/libmp3lame/i386' から出ます
make[2]: *** [all-recursive] エラー 1
make[2]: ディレクトリ `/var/tmp/self-build-lame.L24103/rpm/BUILD/lame-3.97/libmp3lame' から出ます
make[1]: *** [all-recursive] エラー 1
make[1]: ディレクトリ `/var/tmp/self-build-lame.L24103/rpm/BUILD/lame-3.97' から出ます
make: *** [all] エラー 2
エラー: /var/tmp/rpm-tmp.67427 の不正な終了ステータス (%build)
------
nasmのバージョンはnasm-2.02.00-0vl1です。
CPUはi386です。
どうすれば、ビルドできるのでしょうか?
ご助言、よろしくお願い致します。

投稿者 xml-rpc : 2008年4月16日 07:39
役に立ちました?:
過去のフィードバック 平均:(0) 総合:(0) 投票回数:(0)
本記事へのTrackback: http://hoop.euqset.org/blog/mt-tb2006.cgi/72226
トラックバック
コメント
コメントする




画像の中に見える文字を入力してください。