2008年7月17日

[SpamAssassin-JP 696]インストール ちょっと失敗?

** SpamAssassin メーリングリスト **
** 注意:このメールへの返信は SpamAssassin-jp へ行きます **
xeon-koyamaです
MeCab 0.97 のインストールで、ちょっと問題がありました。
環境)
OpenSUSE10.2
Linux ns 2.6.18.8-0.10-default #1 SMP Wed Jun 4 15:46:34 UTC 2008 i686
athlon i386 GNU/Linux

問題箇所)
make check

1つのテストが失敗します。

runtests faild in
FAIL: run-cost-train.sh
===================
1 of 3 tests failed
===================
make[2]: *** [check-TESTS] Error 1
make[2]: Leaving directory `/usr/local/src/mecab-0.97/tests'
make[1]: *** [check-am] Error 2
make[1]: Leaving directory `/usr/local/src/mecab-0.97/tests'
make: *** [check-recursive] Error 1


インストール自体は成功し、 % mecab -O wakati なども
問題なく成功します。


--
SpamAssassin メーリングリスト
http://mm.apache.jp/mailman/listinfo/spamassassin-jp


投稿者 xml-rpc : 2008年7月17日 22:57
役に立ちました?:
過去のフィードバック 平均:(0) 総合:(0) 投票回数:(0)
本記事へのTrackback: http://hoop.euqset.org/blog/mt-tb2006.cgi/75435
トラックバック
コメント
コメントする




画像の中に見える文字を入力してください。